[Buildroot] [autobuild.buildroot.net] Your build results for 2018-12-02

Thomas Petazzoni thomas.petazzoni at bootlin.com
Mon Dec 3 14:34:31 UTC 2018


On Mon, 3 Dec 2018 15:25:25 +0100, Bartosz Golaszewski wrote:

> > How can a bug in pulseview/libsigrokdecode after libttorrent-rasterbar ?
> >
> > See the build failures we are talking about, they affect the
> > libtorrent-rasterbar package:
> >  
> I'm not following you here I'm afraid. This has nothing to do with any
> other package - this is purely a pulseview bug. It appears after my
> previous version bump and is confined to pulseview.

Are you looking at:


Let me paste the relevant part:

In file included from peer_connection.cpp:56:0:
../include/libtorrent/peer_connection.hpp:550:8: error: generic thunk code fails for method 'virtual void libtorrent::peer_connection::_ZThn96_NK10libtorrent15peer_connection8peer_logENS_14peer_log_alert11direction_tEPKcS4_z(libtorrent::peer_log_alert::direction_t, const char*, const char*, ...) const' which uses '...'
   void peer_log(peer_log_alert::direction_t direction
make[2]: *** [peer_connection.lo] Error 1
make[2]: *** Waiting for unfinished jobs....
make[2]: Leaving directory `/home/dawncrow/buildroot-test/scripts/instance-0/output/build/libtorrent-rasterbar-1.1.11/src'
make[1]: *** [all-recursive] Error 1
make[1]: Leaving directory `/home/dawncrow/buildroot-test/scripts/instance-0/output/build/libtorrent-rasterbar-1.1.11'
make: *** [/home/dawncrow/buildroot-test/scripts/instance-0/output/build/libtorrent-rasterbar-1.1.11/.stamp_built] Error 2
make: Leaving directory `/home/dawncrow/buildroot-test/scripts/instance-0/buildroot'

Where do you see a pulseview issue ?

Thomas Petazzoni, CTO, Bootlin
Embedded Linux and Kernel engineering

More information about the buildroot mailing list