[Buildroot] [Bug 9566] [kmod] Compilation fails with uclibc

bugzilla at busybox.net bugzilla at busybox.net
Thu Jul 13 14:08:32 UTC 2017


mavik30 at yahoo.com changed:

           What    |Removed                     |Added
         Resolution|FIXED                       |---
             Status|RESOLVED                    |REOPENED

--- Comment #3 from mavik30 at yahoo.com ---

I got the same error, i followed the patch. But still same error.

Can any one tell how solve this issue. 

CCLD     libkmod/libkmod.la
libkmod/.libs/libkmod-module.o: In function `kmod_module_remove_module':
libkmod-module.c:(.text.kmod_module_remove_module+0x20): undefined reference to
libkmod/.libs/libkmod-module.o: In function `kmod_module_insert_module':
libkmod-module.c:(.text.kmod_module_insert_module+0x21c): undefined reference
to `init_module'
collect2: error: ld returned 1 exit status
make[4]: *** [libkmod/libkmod.la] Error 1
make[3]: *** [all-recursive] Error 1
make[2]: *** [all] Error 2
make[1]: *** [/home/marvik/buildroot/output/build/kmod-23/.stamp_built] Error 2
make: *** [_all] Error 2


You are receiving this mail because:
You are on the CC list for the bug.

More information about the buildroot mailing list