[Buildroot] [autobuild.buildroot.net] Build results for 2013-11-22

Thomas De Schampheleire patrickdepinguin at gmail.com
Sat Nov 23 13:11:43 UTC 2013


Hi,

On Sat, Nov 23, 2013 at 8:30 AM, Thomas Petazzoni
<thomas.petazzoni at free-electrons.com> wrote:
> Build statistics for 2013-11-22
> ===============================
>
>         success : 68
>        failures : 34
>        timeouts : 0
>           TOTAL : 102
>
[..]

>       sh4a |                   poco-1.4.6p1 | NOK | http://autobuild.buildroot.net/results/8dc9bca5969d455cc30206fc1ae6e1d3ba6eb6ca/

Error is:

In file included from src/FPEnvironment_C99.cpp:37:0,
                 from src/FPEnvironment.cpp:48:
include/Poco/FPEnvironment_C99.h:56:30: error: 'FE_DOWNWARD' was not
declared in this scope
include/Poco/FPEnvironment_C99.h:57:30: error: 'FE_UPWARD' was not
declared in this scope
make[2]: *** [/home/test/test/2/output/build/poco-1.4.6p1/Foundation/obj/Linux/sh4a/release_shared/FPEnvironment.o]
Error 1
make[2]: Leaving directory
`/home/test/test/2/output/build/poco-1.4.6p1/Foundation'
make[1]: *** [Foundation-libexec] Error 2
make[1]: Leaving directory `/home/test/test/2/output/build/poco-1.4.6p1'
make: *** [/home/test/test/2/output/build/poco-1.4.6p1/.stamp_built] Error 2


The same build failure has been discussed a long time ago here:
http://lists.busybox.net/pipermail/buildroot/2011-September/046013.html
when the poco package was introduced. Then, the fpenvironment was
disabled when the C library is uclibc.
In the current failure, the C library seems to be glibc.
I'm including Baruch on this one, who was involved in the above
thread. Baruch: any idea?

>        arm |                     systemd-44 | NOK | http://autobuild.buildroot.net/results/e5484bcdcca7f2cb48913d65271de4b957ea3450/
>        arm |                   udisks-1.0.4 | NOK | http://autobuild.buildroot.net/results/ea4627cae45e972ebba5b33a2b2871ce7f46fedc/

I'm looking at the above two ones...

[..]

Best regards,
Thomas


More information about the buildroot mailing list