[Buildroot] Gtk on Arm

Giriprasad Deviprasad g_pr21 at yahoo.in
Mon Oct 11 12:13:55 UTC 2010


I enabled WHAR and C++ in the config, errors as :
In file included from mbchar.h:285,
                 from mbchar.c:22:
wcwidth.h:62: error: expected ')' before 'wc'
In file included from mbchar.c:22:
mbchar.h:294: error: expected specifier-qualifier-list before 'wchar_t'
mbchar.h: In function 'mb_copy':
mbchar.h:390: error: 'mbchar_t' has no member named 'buf'
mbchar.h:392: error: 'mbchar_t' has no member named 'buf'
mbchar.h:392: error: 'mbchar_t' has no member named 'buf'
mbchar.h:393: error: 'mbchar_t' has no member named 'buf'
mbchar.h:399: error: 'mbchar_t' has no member named 'wc'
mbchar.h:399: error: 'mbchar_t' has no member named 'wc'
make[5]: *** [mbchar.o] Error 1

Does your toolchain have C++ and WCHAR support?



-------------- next part --------------
An HTML attachment was scrubbed...
URL: <http://lists.busybox.net/pipermail/buildroot/attachments/20101011/bc9a478a/attachment-0002.html>


More information about the buildroot mailing list