[Buildroot] buildroot compilation problem

David Wooff David.Wooff at calrec.com
Mon May 17 14:02:37 UTC 2010


Hi,
my buildroot compile seems to be getting stuck with an error and I'm not
sure how to cure it.  Would anyone care to advise?  Thanks:
 
/home/dez/buildroot-v23434/build_arm/staging_dir/usr/bin/arm-linux-uclib
cgnueabi-gcc -DMONOLITH -I.. -I../include  -mfloat-abi=soft  -fPIC
-DOPENSSL_PIC -DOPENSSL_THREADS -D_REENTRANT -DDSO_DLFCN -DHAVE_DLFCN_H
-DOPENSSL_NO_KRB5
-I/home/dez/buildroot-v23434/build_arm/staging_dir/usr/include
-DOPENSSL_NO_IDEA -DOPENSSL_NO_MDC2 -DOPENSSL_NO_RC5 -DL_ENDIAN -DTERMIO
-O3 -fomit-frame-pointer -Wall -Os
-I/home/dez/buildroot-v23434/build_arm/staging_dir/usr/include
-I/home/dez/buildroot-v23434/build_arm/staging_dir/include
--sysroot=/home/dez/buildroot-v23434/build_arm/staging_dir/ -isysroot
/home/dez/buildroot-v23434/build_arm/staging_dir -mtune=arm9tdmi
-msoft-float -D_LARGEFILE_SOURCE -D_LARGEFILE64_SOURCE
-D_FILE_OFFSET_BITS=64   -c -o s_client.o s_client.c
/home/dez/buildroot-v23434/build_arm/staging_dir/usr/bin/arm-linux-uclib
cgnueabi-gcc -DMONOLITH -I.. -I../include  -mfloat-abi=soft  -fPIC
-DOPENSSL_PIC -DOPENSSL_THREADS -D_REENTRANT -DDSO_DLFCN -DHAVE_DLFCN_H
-DOPENSSL_NO_KRB5
-I/home/dez/buildroot-v23434/build_arm/staging_dir/usr/include
-DOPENSSL_NO_IDEA -DOPENSSL_NO_MDC2 -DOPENSSL_NO_RC5 -DL_ENDIAN -DTERMIO
-O3 -fomit-frame-pointer -Wall -Os
-I/home/dez/buildroot-v23434/build_arm/staging_dir/usr/include
-I/home/dez/buildroot-v23434/build_arm/staging_dir/include
--sysroot=/home/dez/buildroot-v23434/build_arm/staging_dir/ -isysroot
/home/dez/buildroot-v23434/build_arm/staging_dir -mtune=arm9tdmi
-msoft-float -D_LARGEFILE_SOURCE -D_LARGEFILE64_SOURCE
-D_FILE_OFFSET_BITS=64   -c -o speed.o speed.c
speed.c:122:23: error: sys/timeb.h: No such file or directory
speed.c: In function 'Time_F':
speed.c:350: error: storage size of 'tstart' isn't known
speed.c:350: error: storage size of 'tend' isn't known
speed.c:356: warning: implicit declaration of function 'ftime'
speed.c:350: warning: unused variable 'tend'
speed.c:350: warning: unused variable 'tstart'
make[2]: *** [speed.o] Error 1
make[2]: Leaving directory
`/home/dez/buildroot-v23434/build_arm/openssl-0.9.7m/apps'
make[1]: *** [sub_all] Error 1
make[1]: Leaving directory
`/home/dez/buildroot-v23434/build_arm/openssl-0.9.7m'
make: ***
[/home/dez/buildroot-v23434/build_arm/openssl-0.9.7m/apps/openssl] Error
2


-------------- next part --------------
An HTML attachment was scrubbed...
URL: <http://lists.busybox.net/pipermail/buildroot/attachments/20100517/52f96389/attachment.html>


More information about the buildroot mailing list