[Buildroot] haserl don't compile - ERROR

Sushi Sensei sinestado at gmail.com
Fri Oct 12 15:44:54 UTC 2007


/tmp/BUILDROOT/buildroot/build_i686/staging_dir/usr/bin/i686-linux-uclibc-gcc
-g -O2 -Wall  -o haserl  haserl.o
haserl.o: In function `myputenv':
/tmp/BUILDROOT/buildroot/build_i686/haserl-0.8.0/src/haserl.c:134: undefined
reference to `index'
collect2: ld returned 1 exit status
make[2]: *** [haserl] Error 1
make[2]: se sale del directorio `/tmp/BUILDROOT/buildroot/build_i686/haserl-
0.8.0/src'
make[1]: *** [all-recursive] Error 1
make[1]: se sale del directorio `/tmp/BUILDROOT/buildroot/build_i686/haserl-
0.8.0'
make: *** [/tmp/BUILDROOT/buildroot/build_i686/haserl-0.8.0/src/haserl]
Error 2


-- 
------------------------------------------------------
--- Timeo Danaos et dona ferentes ---
------------------------------------------------------
-------------- next part --------------
An HTML attachment was scrubbed...
URL: http://lists.busybox.net/pipermail/buildroot/attachments/20071012/ee22b62c/attachment-0001.htm 


More information about the buildroot mailing list